Firefox 52 ESR Install Build Fails on Itanium64

classic Classic list List threaded Threaded
1 message Options
Reply | Threaded
Open this post in threaded view
|  
Report Content as Inappropriate

Firefox 52 ESR Install Build Fails on Itanium64

Charles G Robertson
Hi,

Hoping someone can help me with this problem.

Building Firefox 52 ESR install build on ia64 fails with the following error below.
Any ideas on how I can fix this?

(see firefox.install.build.log attached for complete build log)

Thanks
Cheers
  Charles Robertson
  SUSE Firefox Maintainer

========================================================================
...
resource://gre/modules/addons/LightweightThemeImageOptimizer.jsm
resource://gre/modules/addons/PluginProvider.jsm
resource://gre/modules/addons/ProductAddonChecker.jsm
resource://gre/modules/addons/SpellCheckDictionaryBootstrap.js
resource://gre/modules/addons/WebExtensionBootstrap.js
resource://gre/modules/addons/XPIProvider.jsm
Traceback (most recent call last):
  File "/usr/src/packages/BUILD/mozilla/toolkit/mozapps/installer/packager.py", line 415, in <module>
    main()
  File "/usr/src/packages/BUILD/mozilla/toolkit/mozapps/installer/packager.py", line 409, in main
    args.source, gre_path, base)
  File "/usr/src/packages/BUILD/mozilla/toolkit/mozapps/installer/packager.py", line 166, in precompile_cache
    errors.fatal('Error while running startup cache precompilation')
  File "/usr/src/packages/BUILD/mozilla/python/mozbuild/mozpack/errors.py", line 103, in fatal
    self._handle(self.FATAL, msg)
  File "/usr/src/packages/BUILD/mozilla/python/mozbuild/mozpack/errors.py", line 98, in _handle
    raise ErrorMessage(msg)
mozpack.errors.ErrorMessage: Error: Error while running startup cache precompilation
make[2]: *** [stage-package] Error 1
make[2]: Leaving directory `/usr/src/packages/BUILD/obj/browser/installer'
make[1]: *** [make-package] Error 2
make[1]: Leaving directory `/usr/src/packages/BUILD/obj/browser/installer'
make: *** [default] Error 2
make: Leaving directory `/usr/src/packages/BUILD/obj/browser/installer'
error: Bad exit status from /var/tmp/rpm-tmp.96148 (%install)


_______________________________________________
dev-builds mailing list
[hidden email]
https://lists.mozilla.org/listinfo/dev-builds
Loading...