Failed to build firefox from source(Windows 10 x86-64 64)

classic Classic list List threaded Threaded
4 messages Options
Reply | Threaded
Open this post in threaded view
|

Failed to build firefox from source(Windows 10 x86-64 64)

moritzbrunner2000
Hi,
i tried to build firefox 64 bit version from source but the compilation fails...
PS:Im new to mozilla
OS:Windows 10 Pro x86-64
Source:mozilla-central(last update:7.2.2016 9:15)
mozilla-build:2.1.0
mozconfig:
ac_add_options --enable-application=browser
mk_add_options MOZ_OBJDIR=@TOPSRCDIR@/../objdir
ac_add_options --target=x86_64-pc-mingw32
 ac_add_options --host=x86_64-pc-mingw32

log:
  0:02.39 c:\mozilla-build\mozmake\mozmake.EXE -f client.mk -s
 0:05.91 Adding client.mk options from c:/mozilla-source/mozilla-central/mozconfig:
 0:05.91     CONFIG_GUESS=x86_64-pc-mingw32
 0:05.91     CONFIG_GUESS=x86_64-pc-mingw32
 0:05.91     MOZ_OBJDIR=c:/mozilla-source/objdir
 0:05.91     OBJDIR=c:/mozilla-source/objdir
 0:05.91     FOUND_MOZCONFIG=c:/mozilla-source/mozilla-central/mozconfig
 0:12.50 Elapsed: 0.00s; From dist/branding: Kept 15 existing; Added/updated 0; Removed 0 files and 0 directories.
 0:12.80 Elapsed: 0.31s; From dist/idl: Kept 1150 existing; Added/updated 0; Removed 0 files and 0 directories.
 0:12.94 Elapsed: 0.00s; From dist/public: Kept 0 existing; Added/updated 0; Removed 0 files and 0 directories.
 0:13.16 Elapsed: 0.06s; From dist/private: Kept 0 existing; Added/updated 0; Removed 158 files and 2 directories.
 0:13.33 Elapsed: 0.00s; From dist/sdk: Kept 0 existing; Added/updated 0; Removed 9 files and 2 directories.
 0:13.55 Elapsed: 0.91s; From dist/include: Kept 4736 existing; Added/updated 0; Removed 235 files and 6 directories.
 0:13.61 Elapsed: 0.05s; From dist/xpi-stage: Kept 12 existing; Added/updated 0; Removed 2 files and 3 directories.
 0:14.20 Elapsed: 0.45s; From dist/bin: Kept 1742 existing; Added/updated 0; Removed 12 files and 1 directories.
 0:19.41 Elapsed: 5.70s; From _tests: Kept 24593 existing; Added/updated 0; Removed 1 files and 1 directories.
 0:21.94 Elapsed: 0.22s; From ../../dist/idl: Kept 1150 existing; Added/updated 0; Removed 0 files and 0 directories.
 0:23.37 cd include; c:/mozilla-build/mozmake/mozmake.EXE private_export
 0:23.80 Creating c:/mozilla-source/objdir/dist/private/dbm
 0:24.08 cd src; c:/mozilla-build/mozmake/mozmake.EXE private_export
 0:24.44 Creating c:/mozilla-source/objdir/dist/private/nss
 0:24.55 There are no private exports.
 0:24.58 There are no private exports.
 0:25.03 cd mangle; c:/mozilla-build/mozmake/mozmake.EXE private_export
 0:25.08 There are no private exports.
 0:25.48 There are no private exports.
 0:25.52 There are no private exports.
 0:25.59 There are no private exports.
 0:26.00 There are no private exports.
 0:26.52 There are no private exports.
 0:32.55 There are no private exports.
 0:33.00 There are no private exports.
 0:35.98 cd legacydb; c:/mozilla-build/mozmake/mozmake.EXE private_export
 0:36.58 There are no private exports.
 0:37.23 There are no private exports.
 0:38.37 cd builtins; c:/mozilla-build/mozmake/mozmake.EXE private_export
 0:38.73 There are no private exports.
 0:39.55 cd include; c:/mozilla-build/mozmake/mozmake.EXE private_export
 0:40.11 cd pkix; c:/mozilla-build/mozmake/mozmake.EXE private_export
 0:40.59 cd certsel; c:/mozilla-build/mozmake/mozmake.EXE private_export
 0:41.01 cd include; c:/mozilla-build/mozmake/mozmake.EXE export
 0:41.03 cd crlsel; c:/mozilla-build/mozmake/mozmake.EXE private_export
 0:41.50 Creating c:/mozilla-source/objdir/dist/include/dbm
 0:41.50 cd checker; c:/mozilla-build/mozmake/mozmake.EXE private_export
 0:41.59 There are no private exports.
 0:41.84 cd src; c:/mozilla-build/mozmake/mozmake.EXE export
 0:41.97 cd params; c:/mozilla-build/mozmake/mozmake.EXE private_export
 0:42.51 cd results; c:/mozilla-build/mozmake/mozmake.EXE private_export
 0:42.64 There are no private exports.
 0:43.09 cd store; c:/mozilla-build/mozmake/mozmake.EXE private_export
 0:43.22 cd mangle; c:/mozilla-build/mozmake/mozmake.EXE export
 0:43.72 cd top; c:/mozilla-build/mozmake/mozmake.EXE private_export
 0:44.42 cd util; c:/mozilla-build/mozmake/mozmake.EXE private_export
 0:45.01 There are no private exports.
 0:45.08 cd pkix_pl_nss; c:/mozilla-build/mozmake/mozmake.EXE private_export
 0:45.56 cd pki; c:/mozilla-build/mozmake/mozmake.EXE private_export
 0:45.62 Creating c:/mozilla-source/objdir/dist/include/nss
 0:45.73 There are no private exports.
 0:46.09 cd system; c:/mozilla-build/mozmake/mozmake.EXE private_export
 0:46.62 cd module; c:/mozilla-build/mozmake/mozmake.EXE private_export
 0:47.22 There are no private exports.
 0:47.26 There are no private exports.
 0:47.26 There are no private exports.
 0:47.90 There are no private exports.
 0:48.53 There are no private exports.
 0:49.08 There are no private exports.
 0:49.59 There are no private exports.
 0:50.08 There are no private exports.
 0:50.65 There are no private exports.
 0:51.17 There are no private exports.
 0:51.22 There are no private exports.
 0:51.61 There are no private exports.
 0:51.62 There are no private exports.
 0:52.05 There are no private exports.
 0:52.08 There are no private exports.
 0:52.50 There are no private exports.
 0:52.51 There are no private exports.
 0:52.95 There are no private exports.
 0:52.97 There are no private exports.
 0:53.34 There are no private exports.
 0:53.92 There are no private exports.
 0:57.25 There are no private exports.
 0:57.79 cd legacydb; c:/mozilla-build/mozmake/mozmake.EXE export
 0:58.25 There are no private exports.
 0:58.28 cd legacydb; c:/mozilla-build/mozmake/mozmake.EXE private_export
 0:58.76 There are no private exports.
 0:58.79 There are no private exports.
 0:59.73 There are no private exports.
 1:00.23 cd builtins; c:/mozilla-build/mozmake/mozmake.EXE export
 1:00.76 cd builtins; c:/mozilla-build/mozmake/mozmake.EXE private_export
 1:01.22 There are no private exports.
 1:01.54 There are no private exports.
 1:01.56 There are no private exports.
 1:02.03 There are no private exports.
 1:02.03 cd include; c:/mozilla-build/mozmake/mozmake.EXE export
 1:02.09 cd include; c:/mozilla-build/mozmake/mozmake.EXE private_export
 1:02.42 There are no private exports.
 1:02.45 cd pkix; c:/mozilla-build/mozmake/mozmake.EXE export
 1:02.47 There are no private exports.
 1:02.50 cd pkix; c:/mozilla-build/mozmake/mozmake.EXE private_export
 1:02.93 cd certsel; c:/mozilla-build/mozmake/mozmake.EXE export
 1:03.01 cd certsel; c:/mozilla-build/mozmake/mozmake.EXE private_export
 1:03.34 There are no private exports.
 1:03.39 cd crlsel; c:/mozilla-build/mozmake/mozmake.EXE export
 1:03.50 There are no private exports.
 1:03.58 cd crlsel; c:/mozilla-build/mozmake/mozmake.EXE private_export
 1:03.81 There are no private exports.
 1:03.84 cd checker; c:/mozilla-build/mozmake/mozmake.EXE export
 1:04.04 There are no private exports.
 1:04.08 cd checker; c:/mozilla-build/mozmake/mozmake.EXE private_export
 1:04.31 There are no private exports.
 1:04.34 cd params; c:/mozilla-build/mozmake/mozmake.EXE export
 1:04.54 There are no private exports.
 1:04.58 cd params; c:/mozilla-build/mozmake/mozmake.EXE private_export
 1:04.79 There are no private exports.
 1:04.83 cd results; c:/mozilla-build/mozmake/mozmake.EXE export
 1:05.03 There are no private exports.
 1:05.06 cd results; c:/mozilla-build/mozmake/mozmake.EXE private_export
 1:05.29 There are no private exports.
 1:05.33 cd store; c:/mozilla-build/mozmake/mozmake.EXE export
 1:05.67 There are no private exports.
 1:05.70 There are no private exports.
 1:05.70 cd store; c:/mozilla-build/mozmake/mozmake.EXE private_export
 1:05.73 cd top; c:/mozilla-build/mozmake/mozmake.EXE export
 1:06.14 There are no private exports.
 1:06.15 There are no private exports.
 1:06.17 cd util; c:/mozilla-build/mozmake/mozmake.EXE export
 1:06.18 cd top; c:/mozilla-build/mozmake/mozmake.EXE private_export
 1:06.62 There are no private exports.
 1:06.64 There are no private exports.
 1:06.65 cd certsel; c:/mozilla-build/mozmake/mozmake.EXE private_export
 1:06.67 cd util; c:/mozilla-build/mozmake/mozmake.EXE private_export
 1:07.12 There are no private exports.
 1:07.12 There are no private exports.
 1:07.15 There are no private exports.
 1:07.15 cd crlsel; c:/mozilla-build/mozmake/mozmake.EXE private_export
 1:07.18 cd pkix_pl_nss; c:/mozilla-build/mozmake/mozmake.EXE private_export
 1:07.59 There are no private exports.
 1:07.61 cd pki; c:/mozilla-build/mozmake/mozmake.EXE private_export
 1:07.64 cd checker; c:/mozilla-build/mozmake/mozmake.EXE private_export
 1:08.01 There are no private exports.
 1:08.06 There are no private exports.
 1:08.06 cd system; c:/mozilla-build/mozmake/mozmake.EXE private_export
 1:08.11 cd params; c:/mozilla-build/mozmake/mozmake.EXE private_export
 1:08.48 There are no private exports.
 1:08.51 There are no private exports.
 1:08.54 cd results; c:/mozilla-build/mozmake/mozmake.EXE private_export
 1:08.58 cd module; c:/mozilla-build/mozmake/mozmake.EXE private_export
 1:09.00 There are no private exports.
 1:09.00 There are no private exports.
 1:09.04 There are no private exports.
 1:09.04 cd store; c:/mozilla-build/mozmake/mozmake.EXE private_export
 1:09.11 There are no private exports.
 1:09.51 There are no private exports.
 1:09.54 cd top; c:/mozilla-build/mozmake/mozmake.EXE private_export
 1:10.00 There are no private exports.
 1:10.03 cd util; c:/mozilla-build/mozmake/mozmake.EXE private_export
 1:10.51 There are no private exports.
 1:10.54 There are no private exports.
 1:10.58 cd pkix_pl_nss; c:/mozilla-build/mozmake/mozmake.EXE export
 1:11.03 cd pki; c:/mozilla-build/mozmake/mozmake.EXE export
 1:11.03 cd pki; c:/mozilla-build/mozmake/mozmake.EXE private_export
 1:11.47 There are no private exports.
 1:11.48 There are no private exports.
 1:11.50 cd system; c:/mozilla-build/mozmake/mozmake.EXE export
 1:11.50 cd system; c:/mozilla-build/mozmake/mozmake.EXE private_export
 1:11.97 There are no private exports.
 1:11.98 There are no private exports.
 1:12.00 cd module; c:/mozilla-build/mozmake/mozmake.EXE export
 1:12.00 cd module; c:/mozilla-build/mozmake/mozmake.EXE private_export
 1:12.47 There are no private exports.
 1:12.48 There are no private exports.
 1:12.51 There are no private exports.
 1:14.36 mozmake.EXE[6]: warning: -jN forced in submake: disabling jobserver mode.
 1:14.37 Note: rebuild with "c:/mozilla-build/mozmake/mozmake.EXE VERBOSE=1 " to show all compiler parameters.
 1:14.42 c:/mozilla-build/mozmake/mozmake.EXE[6]: Making `all' in `stubdata'
 1:14.54 c:/mozilla-build/mozmake/mozmake.EXE[6]: Making `all' in `common'
 1:14.65 c:/mozilla-build/mozmake/mozmake.EXE[6]: Making `all' in `i18n'
 1:14.78 c:/mozilla-build/mozmake/mozmake.EXE[6]: Making `all' in `tools'
 1:14.86 c:/mozilla-build/mozmake/mozmake.EXE[7]: Making `all' in `toolutil'
 1:14.98 c:/mozilla-build/mozmake/mozmake.EXE[7]: Making `all' in `ctestfw'
 1:15.08 c:/mozilla-build/mozmake/mozmake.EXE[7]: Making `all' in `makeconv'
 1:15.11 c:/mozilla-build/mozmake/mozmake.EXE[7]: Making `all' in `genrb'
 1:15.14 c:/mozilla-build/mozmake/mozmake.EXE[7]: Making `all' in `genbrk'
 1:15.18 c:/mozilla-build/mozmake/mozmake.EXE[7]: Making `all' in `gencnval'
 1:15.23 c:/mozilla-build/mozmake/mozmake.EXE[7]: Making `all' in `gensprep'
 1:15.29 c:/mozilla-build/mozmake/mozmake.EXE[7]: Making `all' in `icuinfo'
 1:15.33 c:/mozilla-build/mozmake/mozmake.EXE[7]: Making `all' in `genccode'
 1:15.36 c:/mozilla-build/mozmake/mozmake.EXE[7]: Making `all' in `gencmn'
 1:15.39 c:/mozilla-build/mozmake/mozmake.EXE[7]: Making `all' in `icupkg'
 1:15.43 c:/mozilla-build/mozmake/mozmake.EXE[7]: Making `all' in `pkgdata'
 1:15.50 c:/mozilla-build/mozmake/mozmake.EXE[7]: Making `all' in `gentest'
 1:15.53 c:/mozilla-build/mozmake/mozmake.EXE[7]: Making `all' in `gennorm2'
 1:15.56 c:/mozilla-build/mozmake/mozmake.EXE[7]: Making `all' in `gencfu'
 1:15.59 c:/mozilla-build/mozmake/mozmake.EXE[7]: Making `all' in `gendict'
 1:15.64 c:/mozilla-build/mozmake/mozmake.EXE[6]: Making `all' in `data'
 1:15.97 Note: rebuild with "c:/mozilla-build/mozmake/mozmake.EXE VERBOSE=1 all-local" to show all compiler parameters.
 1:18.17 Unified_cpp_widget_windows1.obj
 1:18.18 Unified_cpp_widget_windows2.obj
 1:29.84 Unified_cpp_widget_windows1.cpp
 1:29.84 c:/mozilla-source/mozilla-central/widget/windows/nsDeviceContextSpecWin.cpp(447): error C2664: "HDC CreateICW(LPCWSTR,LPCWSTR,LPCWSTR,const DEVMODEW *)" : Konvertierung von Argument 2 von "const char16_t *" in "LPCWSTR" nicht m�glich
 1:29.84 c:/mozilla-source/mozilla-central/widget/windows/nsDeviceContextSpecWin.cpp(447): note: Die Typen, auf die verwiesen wird, sind nicht verkn�pft; die Konvertierung erfordert einen reinterpret_cast-Operator oder eine Typumwandlung im C- oder Funktionsformat.
 1:29.84
 1:29.84 In the directory  /c/mozilla-source/objdir/widget/windows
 1:29.84 The following command failed to execute properly:
 1:29.84 c:/mozilla-source/objdir/_virtualenv/Scripts/python.exe -m mozbuild.action.cl cl -FoUnified_cpp_widget_windows1.obj -c -Ic:/mozilla-source/objdir/dist/stl_wrappers -DNDEBUG=1 -DTRIMMED=1 -DWIN32_LEAN_AND_MEAN -D_WIN32 -DWIN32 -D_CRT_RAND_S -DCERT_CHAIN_PARA_HAS_EXTRA_FIELDS -DOS_WIN=1 -D_UNICODE -DCHROMIUM_BUILD -DU_STATIC_IMPLEMENTATION -DUNICODE -D_WINDOWS -D_SECURE_ATL -DCOMPILER_MSVC -DMOZ_UNICODE -DSTATIC_EXPORTABLE_JS_API -DMOZILLA_INTERNAL_API -DIMPL_LIBXUL -Ic:/mozilla-source/mozilla-central/widget/windows -Ic:/mozilla-source/objdir/widget/windows -Ic:/mozilla-source/objdir/ipc/ipdl/_ipdlheaders -Ic:/mozilla-source/mozilla-central/ipc/chromium/src -Ic:/mozilla-source/mozilla-central/ipc/glue -Ic:/mozilla-source/mozilla-central/layout/generic -Ic:/mozilla-source/mozilla-central/layout/xul -Ic:/mozilla-source/mozilla-central/toolkit/xre -Ic:/mozilla-source/mozilla-central/widget -Ic:/mozilla-source/mozilla-central/xpcom/base -Ic:/mozilla-source/objdir/dist/include -Ic:/mozilla-source/objdir/dist/include/nspr -Ic:/mozilla-source/objdir/dist/include/nss -MD -FI c:/mozilla-source/objdir/mozilla-config.h -DMOZILLA_CLIENT -TP -nologo -Wv:18 -Zc:sizedDealloc- -Zc:threadSafeInit- -wd4091 -D_HAS_EXCEPTIONS=0 -W3 -Gy -FS -wd4251 -wd4244 -wd4267 -wd4345 -wd4351 -wd4800 -wd4819 -we4553 -GR- -Zi -UDEBUG -DNDEBUG -O1 -Oi -Oy -Ic:/mozilla-source/objdir/dist/include/cairo -Fdgenerated.pdb c:/mozilla-source/objdir/widget/windows/Unified_cpp_widget_windows1.cpp
 1:29.86 c:/mozilla-source/mozilla-central/config/rules.mk:967: recipe for target 'Unified_cpp_widget_windows1.obj' failed
 1:29.86 mozmake.EXE[5]: *** [Unified_cpp_widget_windows1.obj] Error 1
 1:29.86 mozmake.EXE[5]: *** Waiting for unfinished jobs....
 1:30.18 nsPresArena.obj
 1:30.18 nsRefreshDriver.obj
 1:35.45 Unified_cpp_widget_windows2.cpp
 1:35.50 c:/mozilla-source/mozilla-central/config/recurse.mk:71: recipe for target 'widget/windows/target' failed
 1:35.50 mozmake.EXE[4]: *** [widget/windows/target] Error 2
 1:35.50 mozmake.EXE[4]: *** Waiting for unfinished jobs....
 1:35.50 Unified_cpp_layout_base0.obj
 1:36.51 nsPresArena.cpp
 1:36.53 Unified_cpp_layout_base1.obj
 1:44.93 nsRefreshDriver.cpp
 1:44.95 Unified_cpp_layout_base2.obj
 1:52.01 Unified_cpp_layout_base0.cpp
 2:04.32 Unified_cpp_layout_base1.cpp
 2:13.37 Unified_cpp_layout_base2.cpp
 2:13.39 layout_base.lib.desc
 2:13.68 c:/mozilla-source/mozilla-central/config/recurse.mk:32: recipe for target 'compile' failed
 2:13.68 mozmake.EXE[3]: *** [compile] Error 2
 2:13.68 c:/mozilla-source/mozilla-central/config/rules.mk:557: recipe for target 'default' failed
 2:13.68 mozmake.EXE[2]: *** [default] Error 2
 2:13.68 c:/mozilla-source/mozilla-central/client.mk:396: recipe for target 'realbuild' failed
 2:13.68 mozmake.EXE[1]: *** [realbuild] Error 2
 2:13.68 client.mk:171: recipe for target 'build' failed
 2:13.68 mozmake.EXE: *** [build] Error 2
 2:13.70 1 compiler warnings present.
_______________________________________________
dev-builds mailing list
[hidden email]
https://lists.mozilla.org/listinfo/dev-builds
Reply | Threaded
Open this post in threaded view
|

Re: Failed to build firefox from source(Windows 10 x86-64 64)

Stefan Sitter-2
On 07.02.2016 12:53, [hidden email] wrote:
>  1:29.84 c:/mozilla-source/mozilla-central/widget/windows/nsDeviceContextSpecWin.cpp(447): error C2664: "HDC CreateICW(LPCWSTR,LPCWSTR,LPCWSTR,const DEVMODEW *)" : Konvertierung von Argument 2 von "const char16_t *" in "LPCWSTR" nicht m�glich

I think you are trying to build old source code. This compiler error
with VS2015 was fixed on 2016-01-27 with Bug 1242295.
_______________________________________________
dev-builds mailing list
[hidden email]
https://lists.mozilla.org/listinfo/dev-builds
Reply | Threaded
Open this post in threaded view
|

Re: Failed to build firefox from source(Windows 10 x86-64 64)

moritzbrunner2000
Am Sonntag, 7. Februar 2016 23:07:51 UTC+1 schrieb Stefan Sitter:
> On 07.02.2016 12:53, wrote:
> >  1:29.84 c:/mozilla-source/mozilla-central/widget/windows/nsDeviceContextSpecWin.cpp(447): error C2664: "HDC CreateICW(LPCWSTR,LPCWSTR,LPCWSTR,const DEVMODEW *)" : Konvertierung von Argument 2 von "const char16_t *" in "LPCWSTR" nicht m�glich
>
> I think you are trying to build old source code. This compiler error
> with VS2015 was fixed on 2016-01-27 with Bug 1242295.

I deleted my source code and downloaded it with hg clone, not with the bundle package, and now it worked...
Thank you for answering.
_______________________________________________
dev-builds mailing list
[hidden email]
https://lists.mozilla.org/listinfo/dev-builds
Reply | Threaded
Open this post in threaded view
|

Re: Failed to build firefox from source(Windows 10 x86-64 64)

moritzbrunner2000
In reply to this post by moritzbrunner2000
Am Sonntag, 7. Februar 2016 12:53:12 UTC+1 schrieb [hidden email]:

> Hi,
> i tried to build firefox 64 bit version from source but the compilation fails...
> PS:Im new to mozilla
> OS:Windows 10 Pro x86-64
> Source:mozilla-central(last update:7.2.2016 9:15)
> mozilla-build:2.1.0
> mozconfig:
> ac_add_options --enable-application=browser
> mk_add_options MOZ_OBJDIR=@TOPSRCDIR@/../objdir
> ac_add_options --target=x86_64-pc-mingw32
>  ac_add_options --host=x86_64-pc-mingw32
>
> log:
>   0:02.39 c:\mozilla-build\mozmake\mozmake.EXE -f client.mk -s
>  0:05.91 Adding client.mk options from c:/mozilla-source/mozilla-central/mozconfig:
>  0:05.91     CONFIG_GUESS=x86_64-pc-mingw32
>  0:05.91     CONFIG_GUESS=x86_64-pc-mingw32
>  0:05.91     MOZ_OBJDIR=c:/mozilla-source/objdir
>  0:05.91     OBJDIR=c:/mozilla-source/objdir
>  0:05.91     FOUND_MOZCONFIG=c:/mozilla-source/mozilla-central/mozconfig
>  0:12.50 Elapsed: 0.00s; From dist/branding: Kept 15 existing; Added/updated 0; Removed 0 files and 0 directories.
>  0:12.80 Elapsed: 0.31s; From dist/idl: Kept 1150 existing; Added/updated 0; Removed 0 files and 0 directories.
>  0:12.94 Elapsed: 0.00s; From dist/public: Kept 0 existing; Added/updated 0; Removed 0 files and 0 directories.
>  0:13.16 Elapsed: 0.06s; From dist/private: Kept 0 existing; Added/updated 0; Removed 158 files and 2 directories.
>  0:13.33 Elapsed: 0.00s; From dist/sdk: Kept 0 existing; Added/updated 0; Removed 9 files and 2 directories.
>  0:13.55 Elapsed: 0.91s; From dist/include: Kept 4736 existing; Added/updated 0; Removed 235 files and 6 directories.
>  0:13.61 Elapsed: 0.05s; From dist/xpi-stage: Kept 12 existing; Added/updated 0; Removed 2 files and 3 directories.
>  0:14.20 Elapsed: 0.45s; From dist/bin: Kept 1742 existing; Added/updated 0; Removed 12 files and 1 directories.
>  0:19.41 Elapsed: 5.70s; From _tests: Kept 24593 existing; Added/updated 0; Removed 1 files and 1 directories.
>  0:21.94 Elapsed: 0.22s; From ../../dist/idl: Kept 1150 existing; Added/updated 0; Removed 0 files and 0 directories.
>  0:23.37 cd include; c:/mozilla-build/mozmake/mozmake.EXE private_export
>  0:23.80 Creating c:/mozilla-source/objdir/dist/private/dbm
>  0:24.08 cd src; c:/mozilla-build/mozmake/mozmake.EXE private_export
>  0:24.44 Creating c:/mozilla-source/objdir/dist/private/nss
>  0:24.55 There are no private exports.
>  0:24.58 There are no private exports.
>  0:25.03 cd mangle; c:/mozilla-build/mozmake/mozmake.EXE private_export
>  0:25.08 There are no private exports.
>  0:25.48 There are no private exports.
>  0:25.52 There are no private exports.
>  0:25.59 There are no private exports.
>  0:26.00 There are no private exports.
>  0:26.52 There are no private exports.
>  0:32.55 There are no private exports.
>  0:33.00 There are no private exports.
>  0:35.98 cd legacydb; c:/mozilla-build/mozmake/mozmake.EXE private_export
>  0:36.58 There are no private exports.
>  0:37.23 There are no private exports.
>  0:38.37 cd builtins; c:/mozilla-build/mozmake/mozmake.EXE private_export
>  0:38.73 There are no private exports.
>  0:39.55 cd include; c:/mozilla-build/mozmake/mozmake.EXE private_export
>  0:40.11 cd pkix; c:/mozilla-build/mozmake/mozmake.EXE private_export
>  0:40.59 cd certsel; c:/mozilla-build/mozmake/mozmake.EXE private_export
>  0:41.01 cd include; c:/mozilla-build/mozmake/mozmake.EXE export
>  0:41.03 cd crlsel; c:/mozilla-build/mozmake/mozmake.EXE private_export
>  0:41.50 Creating c:/mozilla-source/objdir/dist/include/dbm
>  0:41.50 cd checker; c:/mozilla-build/mozmake/mozmake.EXE private_export
>  0:41.59 There are no private exports.
>  0:41.84 cd src; c:/mozilla-build/mozmake/mozmake.EXE export
>  0:41.97 cd params; c:/mozilla-build/mozmake/mozmake.EXE private_export
>  0:42.51 cd results; c:/mozilla-build/mozmake/mozmake.EXE private_export
>  0:42.64 There are no private exports.
>  0:43.09 cd store; c:/mozilla-build/mozmake/mozmake.EXE private_export
>  0:43.22 cd mangle; c:/mozilla-build/mozmake/mozmake.EXE export
>  0:43.72 cd top; c:/mozilla-build/mozmake/mozmake.EXE private_export
>  0:44.42 cd util; c:/mozilla-build/mozmake/mozmake.EXE private_export
>  0:45.01 There are no private exports.
>  0:45.08 cd pkix_pl_nss; c:/mozilla-build/mozmake/mozmake.EXE private_export
>  0:45.56 cd pki; c:/mozilla-build/mozmake/mozmake.EXE private_export
>  0:45.62 Creating c:/mozilla-source/objdir/dist/include/nss
>  0:45.73 There are no private exports.
>  0:46.09 cd system; c:/mozilla-build/mozmake/mozmake.EXE private_export
>  0:46.62 cd module; c:/mozilla-build/mozmake/mozmake.EXE private_export
>  0:47.22 There are no private exports.
>  0:47.26 There are no private exports.
>  0:47.26 There are no private exports.
>  0:47.90 There are no private exports.
>  0:48.53 There are no private exports.
>  0:49.08 There are no private exports.
>  0:49.59 There are no private exports.
>  0:50.08 There are no private exports.
>  0:50.65 There are no private exports.
>  0:51.17 There are no private exports.
>  0:51.22 There are no private exports.
>  0:51.61 There are no private exports.
>  0:51.62 There are no private exports.
>  0:52.05 There are no private exports.
>  0:52.08 There are no private exports.
>  0:52.50 There are no private exports.
>  0:52.51 There are no private exports.
>  0:52.95 There are no private exports.
>  0:52.97 There are no private exports.
>  0:53.34 There are no private exports.
>  0:53.92 There are no private exports.
>  0:57.25 There are no private exports.
>  0:57.79 cd legacydb; c:/mozilla-build/mozmake/mozmake.EXE export
>  0:58.25 There are no private exports.
>  0:58.28 cd legacydb; c:/mozilla-build/mozmake/mozmake.EXE private_export
>  0:58.76 There are no private exports.
>  0:58.79 There are no private exports.
>  0:59.73 There are no private exports.
>  1:00.23 cd builtins; c:/mozilla-build/mozmake/mozmake.EXE export
>  1:00.76 cd builtins; c:/mozilla-build/mozmake/mozmake.EXE private_export
>  1:01.22 There are no private exports.
>  1:01.54 There are no private exports.
>  1:01.56 There are no private exports.
>  1:02.03 There are no private exports.
>  1:02.03 cd include; c:/mozilla-build/mozmake/mozmake.EXE export
>  1:02.09 cd include; c:/mozilla-build/mozmake/mozmake.EXE private_export
>  1:02.42 There are no private exports.
>  1:02.45 cd pkix; c:/mozilla-build/mozmake/mozmake.EXE export
>  1:02.47 There are no private exports.
>  1:02.50 cd pkix; c:/mozilla-build/mozmake/mozmake.EXE private_export
>  1:02.93 cd certsel; c:/mozilla-build/mozmake/mozmake.EXE export
>  1:03.01 cd certsel; c:/mozilla-build/mozmake/mozmake.EXE private_export
>  1:03.34 There are no private exports.
>  1:03.39 cd crlsel; c:/mozilla-build/mozmake/mozmake.EXE export
>  1:03.50 There are no private exports.
>  1:03.58 cd crlsel; c:/mozilla-build/mozmake/mozmake.EXE private_export
>  1:03.81 There are no private exports.
>  1:03.84 cd checker; c:/mozilla-build/mozmake/mozmake.EXE export
>  1:04.04 There are no private exports.
>  1:04.08 cd checker; c:/mozilla-build/mozmake/mozmake.EXE private_export
>  1:04.31 There are no private exports.
>  1:04.34 cd params; c:/mozilla-build/mozmake/mozmake.EXE export
>  1:04.54 There are no private exports.
>  1:04.58 cd params; c:/mozilla-build/mozmake/mozmake.EXE private_export
>  1:04.79 There are no private exports.
>  1:04.83 cd results; c:/mozilla-build/mozmake/mozmake.EXE export
>  1:05.03 There are no private exports.
>  1:05.06 cd results; c:/mozilla-build/mozmake/mozmake.EXE private_export
>  1:05.29 There are no private exports.
>  1:05.33 cd store; c:/mozilla-build/mozmake/mozmake.EXE export
>  1:05.67 There are no private exports.
>  1:05.70 There are no private exports.
>  1:05.70 cd store; c:/mozilla-build/mozmake/mozmake.EXE private_export
>  1:05.73 cd top; c:/mozilla-build/mozmake/mozmake.EXE export
>  1:06.14 There are no private exports.
>  1:06.15 There are no private exports.
>  1:06.17 cd util; c:/mozilla-build/mozmake/mozmake.EXE export
>  1:06.18 cd top; c:/mozilla-build/mozmake/mozmake.EXE private_export
>  1:06.62 There are no private exports.
>  1:06.64 There are no private exports.
>  1:06.65 cd certsel; c:/mozilla-build/mozmake/mozmake.EXE private_export
>  1:06.67 cd util; c:/mozilla-build/mozmake/mozmake.EXE private_export
>  1:07.12 There are no private exports.
>  1:07.12 There are no private exports.
>  1:07.15 There are no private exports.
>  1:07.15 cd crlsel; c:/mozilla-build/mozmake/mozmake.EXE private_export
>  1:07.18 cd pkix_pl_nss; c:/mozilla-build/mozmake/mozmake.EXE private_export
>  1:07.59 There are no private exports.
>  1:07.61 cd pki; c:/mozilla-build/mozmake/mozmake.EXE private_export
>  1:07.64 cd checker; c:/mozilla-build/mozmake/mozmake.EXE private_export
>  1:08.01 There are no private exports.
>  1:08.06 There are no private exports.
>  1:08.06 cd system; c:/mozilla-build/mozmake/mozmake.EXE private_export
>  1:08.11 cd params; c:/mozilla-build/mozmake/mozmake.EXE private_export
>  1:08.48 There are no private exports.
>  1:08.51 There are no private exports.
>  1:08.54 cd results; c:/mozilla-build/mozmake/mozmake.EXE private_export
>  1:08.58 cd module; c:/mozilla-build/mozmake/mozmake.EXE private_export
>  1:09.00 There are no private exports.
>  1:09.00 There are no private exports.
>  1:09.04 There are no private exports.
>  1:09.04 cd store; c:/mozilla-build/mozmake/mozmake.EXE private_export
>  1:09.11 There are no private exports.
>  1:09.51 There are no private exports.
>  1:09.54 cd top; c:/mozilla-build/mozmake/mozmake.EXE private_export
>  1:10.00 There are no private exports.
>  1:10.03 cd util; c:/mozilla-build/mozmake/mozmake.EXE private_export
>  1:10.51 There are no private exports.
>  1:10.54 There are no private exports.
>  1:10.58 cd pkix_pl_nss; c:/mozilla-build/mozmake/mozmake.EXE export
>  1:11.03 cd pki; c:/mozilla-build/mozmake/mozmake.EXE export
>  1:11.03 cd pki; c:/mozilla-build/mozmake/mozmake.EXE private_export
>  1:11.47 There are no private exports.
>  1:11.48 There are no private exports.
>  1:11.50 cd system; c:/mozilla-build/mozmake/mozmake.EXE export
>  1:11.50 cd system; c:/mozilla-build/mozmake/mozmake.EXE private_export
>  1:11.97 There are no private exports.
>  1:11.98 There are no private exports.
>  1:12.00 cd module; c:/mozilla-build/mozmake/mozmake.EXE export
>  1:12.00 cd module; c:/mozilla-build/mozmake/mozmake.EXE private_export
>  1:12.47 There are no private exports.
>  1:12.48 There are no private exports.
>  1:12.51 There are no private exports.
>  1:14.36 mozmake.EXE[6]: warning: -jN forced in submake: disabling jobserver mode.
>  1:14.37 Note: rebuild with "c:/mozilla-build/mozmake/mozmake.EXE VERBOSE=1 " to show all compiler parameters.
>  1:14.42 c:/mozilla-build/mozmake/mozmake.EXE[6]: Making `all' in `stubdata'
>  1:14.54 c:/mozilla-build/mozmake/mozmake.EXE[6]: Making `all' in `common'
>  1:14.65 c:/mozilla-build/mozmake/mozmake.EXE[6]: Making `all' in `i18n'
>  1:14.78 c:/mozilla-build/mozmake/mozmake.EXE[6]: Making `all' in `tools'
>  1:14.86 c:/mozilla-build/mozmake/mozmake.EXE[7]: Making `all' in `toolutil'
>  1:14.98 c:/mozilla-build/mozmake/mozmake.EXE[7]: Making `all' in `ctestfw'
>  1:15.08 c:/mozilla-build/mozmake/mozmake.EXE[7]: Making `all' in `makeconv'
>  1:15.11 c:/mozilla-build/mozmake/mozmake.EXE[7]: Making `all' in `genrb'
>  1:15.14 c:/mozilla-build/mozmake/mozmake.EXE[7]: Making `all' in `genbrk'
>  1:15.18 c:/mozilla-build/mozmake/mozmake.EXE[7]: Making `all' in `gencnval'
>  1:15.23 c:/mozilla-build/mozmake/mozmake.EXE[7]: Making `all' in `gensprep'
>  1:15.29 c:/mozilla-build/mozmake/mozmake.EXE[7]: Making `all' in `icuinfo'
>  1:15.33 c:/mozilla-build/mozmake/mozmake.EXE[7]: Making `all' in `genccode'
>  1:15.36 c:/mozilla-build/mozmake/mozmake.EXE[7]: Making `all' in `gencmn'
>  1:15.39 c:/mozilla-build/mozmake/mozmake.EXE[7]: Making `all' in `icupkg'
>  1:15.43 c:/mozilla-build/mozmake/mozmake.EXE[7]: Making `all' in `pkgdata'
>  1:15.50 c:/mozilla-build/mozmake/mozmake.EXE[7]: Making `all' in `gentest'
>  1:15.53 c:/mozilla-build/mozmake/mozmake.EXE[7]: Making `all' in `gennorm2'
>  1:15.56 c:/mozilla-build/mozmake/mozmake.EXE[7]: Making `all' in `gencfu'
>  1:15.59 c:/mozilla-build/mozmake/mozmake.EXE[7]: Making `all' in `gendict'
>  1:15.64 c:/mozilla-build/mozmake/mozmake.EXE[6]: Making `all' in `data'
>  1:15.97 Note: rebuild with "c:/mozilla-build/mozmake/mozmake.EXE VERBOSE=1 all-local" to show all compiler parameters.
>  1:18.17 Unified_cpp_widget_windows1.obj
>  1:18.18 Unified_cpp_widget_windows2.obj
>  1:29.84 Unified_cpp_widget_windows1.cpp
>  1:29.84 c:/mozilla-source/mozilla-central/widget/windows/nsDeviceContextSpecWin.cpp(447): error C2664: "HDC CreateICW(LPCWSTR,LPCWSTR,LPCWSTR,const DEVMODEW *)" : Konvertierung von Argument 2 von "const char16_t *" in "LPCWSTR" nicht m�glich
>  1:29.84 c:/mozilla-source/mozilla-central/widget/windows/nsDeviceContextSpecWin.cpp(447): note: Die Typen, auf die verwiesen wird, sind nicht verkn�pft; die Konvertierung erfordert einen reinterpret_cast-Operator oder eine Typumwandlung im C- oder Funktionsformat.
>  1:29.84
>  1:29.84 In the directory  /c/mozilla-source/objdir/widget/windows
>  1:29.84 The following command failed to execute properly:
>  1:29.84 c:/mozilla-source/objdir/_virtualenv/Scripts/python.exe -m mozbuild.action.cl cl -FoUnified_cpp_widget_windows1.obj -c -Ic:/mozilla-source/objdir/dist/stl_wrappers -DNDEBUG=1 -DTRIMMED=1 -DWIN32_LEAN_AND_MEAN -D_WIN32 -DWIN32 -D_CRT_RAND_S -DCERT_CHAIN_PARA_HAS_EXTRA_FIELDS -DOS_WIN=1 -D_UNICODE -DCHROMIUM_BUILD -DU_STATIC_IMPLEMENTATION -DUNICODE -D_WINDOWS -D_SECURE_ATL -DCOMPILER_MSVC -DMOZ_UNICODE -DSTATIC_EXPORTABLE_JS_API -DMOZILLA_INTERNAL_API -DIMPL_LIBXUL -Ic:/mozilla-source/mozilla-central/widget/windows -Ic:/mozilla-source/objdir/widget/windows -Ic:/mozilla-source/objdir/ipc/ipdl/_ipdlheaders -Ic:/mozilla-source/mozilla-central/ipc/chromium/src -Ic:/mozilla-source/mozilla-central/ipc/glue -Ic:/mozilla-source/mozilla-central/layout/generic -Ic:/mozilla-source/mozilla-central/layout/xul -Ic:/mozilla-source/mozilla-central/toolkit/xre -Ic:/mozilla-source/mozilla-central/widget -Ic:/mozilla-source/mozilla-central/xpcom/base -Ic:/mozilla-source/objdir/dist/include -Ic:/mozilla-source/objdir/dist/include/nspr -Ic:/mozilla-source/objdir/dist/include/nss -MD -FI c:/mozilla-source/objdir/mozilla-config.h -DMOZILLA_CLIENT -TP -nologo -Wv:18 -Zc:sizedDealloc- -Zc:threadSafeInit- -wd4091 -D_HAS_EXCEPTIONS=0 -W3 -Gy -FS -wd4251 -wd4244 -wd4267 -wd4345 -wd4351 -wd4800 -wd4819 -we4553 -GR- -Zi -UDEBUG -DNDEBUG -O1 -Oi -Oy -Ic:/mozilla-source/objdir/dist/include/cairo -Fdgenerated.pdb c:/mozilla-source/objdir/widget/windows/Unified_cpp_widget_windows1.cpp
>  1:29.86 c:/mozilla-source/mozilla-central/config/rules.mk:967: recipe for target 'Unified_cpp_widget_windows1.obj' failed
>  1:29.86 mozmake.EXE[5]: *** [Unified_cpp_widget_windows1.obj] Error 1
>  1:29.86 mozmake.EXE[5]: *** Waiting for unfinished jobs....
>  1:30.18 nsPresArena.obj
>  1:30.18 nsRefreshDriver.obj
>  1:35.45 Unified_cpp_widget_windows2.cpp
>  1:35.50 c:/mozilla-source/mozilla-central/config/recurse.mk:71: recipe for target 'widget/windows/target' failed
>  1:35.50 mozmake.EXE[4]: *** [widget/windows/target] Error 2
>  1:35.50 mozmake.EXE[4]: *** Waiting for unfinished jobs....
>  1:35.50 Unified_cpp_layout_base0.obj
>  1:36.51 nsPresArena.cpp
>  1:36.53 Unified_cpp_layout_base1.obj
>  1:44.93 nsRefreshDriver.cpp
>  1:44.95 Unified_cpp_layout_base2.obj
>  1:52.01 Unified_cpp_layout_base0.cpp
>  2:04.32 Unified_cpp_layout_base1.cpp
>  2:13.37 Unified_cpp_layout_base2.cpp
>  2:13.39 layout_base.lib.desc
>  2:13.68 c:/mozilla-source/mozilla-central/config/recurse.mk:32: recipe for target 'compile' failed
>  2:13.68 mozmake.EXE[3]: *** [compile] Error 2
>  2:13.68 c:/mozilla-source/mozilla-central/config/rules.mk:557: recipe for target 'default' failed
>  2:13.68 mozmake.EXE[2]: *** [default] Error 2
>  2:13.68 c:/mozilla-source/mozilla-central/client.mk:396: recipe for target 'realbuild' failed
>  2:13.68 mozmake.EXE[1]: *** [realbuild] Error 2
>  2:13.68 client.mk:171: recipe for target 'build' failed
>  2:13.68 mozmake.EXE: *** [build] Error 2
>  2:13.70 1 compiler warnings present.
_______________________________________________
dev-builds mailing list
[hidden email]
https://lists.mozilla.org/listinfo/dev-builds